{"text_format":"1","workbook":"xlsx","n_sheets":2,"sheets":["Cuota Nivelada","Hoja1"],"not_rendered":{"charts":0,"images":1,"macros":1,"external_links":0,"defined_names":60,"comments":0,"pivot_tables":0},"unopened":[],"bounds":{"document_bytes":16777216,"sheet_cells":100000,"rows_first":2000,"rows_last":500,"rows_between":2000,"halvings":0,"cell_chars":16384,"cell_head_chars":4096},"cells_cut":0,"cells_raw":0,"read":"whole","date_system":"1900"}

{"sheet":"Cuota Nivelada","index":0,"n_rows":499,"n_cols":19,"rows_kept":499,"cut":false,"hidden":false,"merged":[[11,5,11,6],[7,0,7,1],[7,5,7,6],[8,0,8,1],[8,5,8,6],[9,0,9,1],[9,5,9,6],[6,0,6,8],[6,9,6,11],[2,1,2,6],[2,7,2,11],[4,0,4,1],[4,5,4,7],[4,9,4,10]]}
[null,null,null,null,null,null,null,null,null,null,null,{"$f":"NOW()-0.5","v":"2023-05-24T20:28:35.890"},null,null,0,"Redondear en",null,200000,5.0000000000000001E-3]
[null,null,null,null,null,"**El Costo Anual Total(CAT) es para fines informativos y comparativos.",null,null,null,null,null,null,null,null,null,null,null,500000,4.0000000000000001E-3]
[null,"PLAN DE PAGOS",null,null,null,null,null,"COOPERATIVA DE AHORRO Y CREDITO NUEVA VIDA LTDA",null,null,null,null,null,null,"si","Aplica Domingos",null,null,2.5000000000000001E-3]
[]
["Nombre:",null,null,null,null,null,null,null,null,"Código de afiliado:",null,null,false,null,"Dias 360","Calculo de Dias"]
[]
["Especificaciones del prestamo",null,null,null,null,null,null,null,null,"Resumen del préstamo",null,null,null,null,"En Meses","Plazo del préstamo"]
["Importe del préstamo",null,null,null,null,150000,null,"Clase de Interes","Vencidos",null,"Capital efectivo",{"$f":"Importe_del_préstamo-L10-L11","v":150000}]
["Tasa de interés anual",null,null,null,null,0.09,null,"Liqudacion Mensual","Mes Comercial",null,"Número de pagos programado",{"$f":"Años_préstamo","v":12},{"$f":"VLOOKUP($O$7,Hoja1!$A$2:$C$9,3,FALSE)","v":30},null,null,"Fecha primer pago"]
[{"$f":"_xlfn.CONCAT(\"Plazo (\",O7,\")\")","v":"Plazo (En Meses)"},null,null,null,null,12,null,"Fecha",{"$f":"TODAY()","v":"2023-05-25"},null,"Comisión de desembolso (CD)",0,{"$f":"VLOOKUP($O$7,Hoja1!$A$2:$B$9,2,FALSE)","v":12},null,null,"Al Vencimiento"]
[null,null,null,null,null,null,null,null,null,null,"Comisión de gestión (CG)",null,"si"]
["Pago programado",null,null,null,null,{"$f":"INT(PMT(Tasa_de_interés/Núm_pagos_al_año,Años_préstamo,-Importe_del_préstamo))","v":13117},null,"Fecha Final del préstamo",{"$f":"LOOKUP(L9,A20:A499,B20:B499)","v":"2024-05-19"},null,"Interés total",{"$f":"IF(Valores_especificados,SUMIF(Saldo_inicial,\">0\",Int),\"\")","v":7258.8788611667323},"no"]
[null,null,null,null,null,null,null,"Amortizacion","Cuota Nivelada",null,"Costo total mensual del crédito",{"$f":"IRR((OFFSET(G19,,1,(1+L9))),Tasa_de_interés)","v":7.3522019233720481E-3},"Dias Calendario"]
[null,null,null,null,null,null,null,12,null,null,"T.A.E. (CAT) real",{"$f":"IF(Valores_especificados,((1+(L13))^(M18))-1,\"\")","v":9.1882941137891416E-2},"Dias 360"]
[null,null,null,null,null,null,"Pagos adicionales opcionales"]
[]
[]
["Nº Pago","Fecha de pago",null,null,null,"Dias","Saldo inicial","Pago programado","Abono Capital","Interés","Saldo final","Interés acumulativo",{"$f":"VLOOKUP($O$7,Hoja1!$A$2:$B$9,2,FALSE)","v":12}]
[null,null,{"$f":"+O9","v":"00:00:00"},null,{"$f":"IF(WEEKDAY(C19)=1,1,\"\")","v":""},null,null,{"$f":"-L8","v":-150000}]
[{"$f":"IF(Valores_especificados,1,\"\")","v":1},{"$f":"I10+$M$9","v":"2023-06-24"},{"$f":"I10+(365/M$10)","v":"2023-06-24T10:00:00"},{"$f":"IF(O3=M11,IF(O9<>\"\",C19,IF($A$10=$M$9,IF(Núm_de_pago<>\"\",DATE(YEAR(Inicio_prestamo),MONTH(Inicio_prestamo)+(Años_préstamo),DAY(Inicio_prestamo)),\"\"),IF(Núm_de_pago<>\"\",DATE(YEAR(Inicio_prestamo),MONTH(Inicio_prestamo)+(Años_préstamo)*12/Núm_pagos_al_año,DAY(Inicio_prestamo)),\"\"))),IF(O9<>\"\",C19,IF($A$10=$M$9,IF(Núm_de_pago<>\"\",DATE(YEAR(Inicio_prestamo),MONTH(Inicio_prestamo)+(Años_préstamo),DAY(Inicio_prestamo)),\"\"),IF(Núm_de_pago<>\"\",DATE(YEAR(Inicio_prestamo),MONTH(Inicio_prestamo)+(Años_préstamo)*12/Núm_pagos_al_año,DAY(Inicio_prestamo)),\"\")))+1)","v":"2024-05-25"},{"$f":"IF(M5=TRUE,IF(Núm_de_pago<>\"\",IF(WEEKDAY(D20)=1,1,\"\"),\"\"),IF(Núm_de_pago<>\"\",IF(WEEKDAY(C20)=1,1,\"\"),\"\"))","v":""},{"$f":"IF($O$5=$M$14,DAYS360(Inicio_prestamo,B20,TRUE),_xlfn.DAYS(B20,Inicio_prestamo))","v":29},{"$f":"IF(Valores_especificados,Importe_del_préstamo,\"\")","v":150000},{"$f":"IF(Núm_de_pago<>\"\",Pago_mensual_programado,\"\")","v":13117},{"$f":"IF(Núm_de_pago<>\"\",Pago_progr-Int,\"\")","v":12029.5},{"$f":"ROUNDDOWN(IF(Núm_de_pago<>\"\",Saldo_inicial*(Tasa_de_interés/IF($O$5=\"Dias 360\",360,365))*Dias_,\"\"),2)","v":1087.5},{"$f":"IF(Núm_de_pago<>\"\",Saldo_inicial-Capital,IF(Núm_de_pago<>\"\",0,\"\"))","v":137970.5},{"$f":"SUM($J$20:$J20)","v":1087.5}]
[{"$f":"IF(K20=0,\"\",IF(K20=\"\",\"\",IF(Valores_especificados,A20+1,\"\")))","v":2},{"$f":"B20+$M$9","v":"2023-07-24"},{"$f":"B20+(365/M$10)","v":"2023-07-24T10:00:00"},null,{"$f":"IF(Núm_de_pago<>\"\",IF(WEEKDAY(C21)=1,1,\"\"),\"\")","v":""},{"$f":"IF(K20=0,\"\",IF(K20=\"\",\"\",IF($O$5=$M$14,DAYS360(B20,B21,TRUE),_xlfn.DAYS(B21,B20))))","v":30},{"$f":"IF(Núm_de_pago<>\"\",K20,\"\")","v":137970.5},{"$f":"IF(Núm_de_pago<>\"\",IF(K20<Pago_mensual_programado,I21+J21,Pago_mensual_programado),\"\")","v":13117},{"$f":"IF(K20<Pago_mensual_programado,K20,IF(Núm_de_pago<>\"\",Pago_progr-Int,\"\"))","v":12082.22},{"$f":"ROUND(IF(Núm_de_pago<>\"\",Saldo_inicial*(Tasa_de_interés/IF($O$5=\"Dias 360\",360,365))*Dias_,\"\"),2)","v":1034.78},125888.28,{"$f":"IF(A21=\"\",\"\",SUM(OFFSET($I$20,,1,1+A20)))","v":2122.2799999999997}]
[{"$f":"IF(K21=0,\"\",IF(K21=\"\",\"\",IF(Valores_especificados,A21+1,\"\")))","v":3},{"$f":"B21+$M$9","v":"2023-08-23"},{"$f":"B21+(365/M$10)","v":"2023-08-23T10:00:00"},null,"",29,125888.28,13117,12204.30997,{"$f":"IF(Núm_de_pago<>\"\",Saldo_inicial*(Tasa_de_interés/IF($O$5=\"Dias 360\",360,365))*Dias_,\"\")","v":912.69002999999998},113683.97003,3034.9700299999995]
[{"$f":"IF(K22=0,\"\",IF(K22=\"\",\"\",IF(Valores_especificados,A22+1,\"\")))","v":4},"2023-09-22","2023-09-22T10:00:00",null,"",29,113683.97003,13117,12292.7912172825,824.20878271749996,101391.1788127175,3859.1788127174996]
[{"$f":"IF(K23=0,\"\",IF(K23=\"\",\"\",IF(Valores_especificados,A23+1,\"\")))","v":5},"2023-10-22","2023-10-22T10:00:00",null,1,30,101391.1788127175,13117,12356.566158904619,760.43384109538124,89034.612653812874,4619.612653812881]
[{"$f":"IF(K24=0,\"\",IF(K24=\"\",\"\",IF(Valores_especificados,A24+1,\"\")))","v":6},"2023-11-21","2023-11-21T10:00:00",null,"",29,89034.612653812874,13117,12471.499058259857,645.50094174014328,76563.113595553019,5265.1135955530244]
[{"$f":"IF(K25=0,\"\",IF(K25=\"\",\"\",IF(Valores_especificados,A25+1,\"\")))","v":7},"2023-12-21","2023-12-21T10:00:00",null,"",30,76563.113595553019,13117,12542.776648033352,574.22335196664767,64020.336947519667,5839.3369475196723]
[{"$f":"IF(K26=0,\"\",IF(K26=\"\",\"\",IF(Valores_especificados,A26+1,\"\")))","v":8},"2024-01-20","2024-01-20T10:00:00",null,"",29,64020.336947519667,13117,12652.852557130482,464.14744286951759,51367.484390389189,6303.4843903891897]
[{"$f":"IF(K27=0,\"\",IF(K27=\"\",\"\",IF(Valores_especificados,A27+1,\"\")))","v":9},"2024-02-19","2024-02-19T10:00:00",null,"",29,51367.484390389189,13117,12744.585738169679,372.41426183032161,38622.898652219512,6675.898652219511]
[{"$f":"IF(K28=0,\"\",IF(K28=\"\",\"\",IF(Valores_especificados,A28+1,\"\")))","v":10},"2024-03-20","2024-03-20T10:00:00",null,"",31,38622.898652219512,13117,12817.672535445299,299.32746455470124,25805.226116774211,6975.2261167742126]
[{"$f":"IF(K29=0,\"\",IF(K29=\"\",\"\",IF(Valores_especificados,A29+1,\"\")))","v":11},"2024-04-19","2024-04-19T10:00:00",null,"",29,25805.226116774211,13117,12929.912110653388,187.08788934661303,12875.314006120823,7162.314006120826]
[{"$f":"IF(K30=0,\"\",IF(K30=\"\",\"\",IF(Valores_especificados,A30+1,\"\")))","v":12},"2024-05-19","2024-05-19T10:00:00",null,1,30,12875.314006120823,12971.87886116673,12875.314006120823,96.564855045906185,0,7258.8788611667323]
[{"$f":"IF(K31=0,\"\",IF(K31=\"\",\"\",IF(Valores_especificados,A31+1,\"\")))","v":""},"2024-06-18","2024-06-18T10:00:00",null,"","","","",0,"","",""]
[{"$f":"IF(K32=0,\"\",IF(K32=\"\",\"\",IF(Valores_especificados,A32+1,\"\")))","v":""},"2024-07-18","2024-07-18T10:00:00",null,"","","","","","","",""]
[{"$f":"IF(K33=0,\"\",IF(K33=\"\",\"\",IF(Valores_especificados,A33+1,\"\")))","v":""},"2024-08-17","2024-08-17T10:00:00",null,"","","","","","","",""]
[{"$f":"IF(K34=0,\"\",IF(K34=\"\",\"\",IF(Valores_especificados,A34+1,\"\")))","v":""},"2024-09-16","2024-09-16T10:00:00",null,"","","","","","","",""]
[{"$f":"IF(K35=0,\"\",IF(K35=\"\",\"\",IF(Valores_especificados,A35+1,\"\")))","v":""},"2024-10-16","2024-10-16T10:00:00",null,"","","","","","","",""]
[{"$f":"IF(K36=0,\"\",IF(K36=\"\",\"\",IF(Valores_especificados,A36+1,\"\")))","v":""},"2024-11-15","2024-11-15T10:00:00",null,"","","","","","","",""]
[{"$f":"IF(K37=0,\"\",IF(K37=\"\",\"\",IF(Valores_especificados,A37+1,\"\")))","v":""},"2024-12-15","2024-12-15T10:00:00",null,"","","","","","","",""]
[{"$f":"IF(K38=0,\"\",IF(K38=\"\",\"\",IF(Valores_especificados,A38+1,\"\")))","v":""},"2025-01-14","2025-01-14T10:00:00",null,"","","","","","","",""]
[{"$f":"IF(K39=0,\"\",IF(K39=\"\",\"\",IF(Valores_especificados,A39+1,\"\")))","v":""},"2025-02-13","2025-02-13T10:00:00",null,"","","","","","","",""]
[{"$f":"IF(K40=0,\"\",IF(K40=\"\",\"\",IF(Valores_especificados,A40+1,\"\")))","v":""},"2025-03-15","2025-03-15T10:00:00",null,"","","","","","","",""]
[{"$f":"IF(K41=0,\"\",IF(K41=\"\",\"\",IF(Valores_especificados,A41+1,\"\")))","v":""},"2025-04-14","2025-04-14T10:00:00",null,"","","","","","","",""]
[{"$f":"IF(K42=0,\"\",IF(K42=\"\",\"\",IF(Valores_especificados,A42+1,\"\")))","v":""},"2025-05-14","2025-05-14T10:00:00",null,"","","","","","","",""]
[{"$f":"IF(K43=0,\"\",IF(K43=\"\",\"\",IF(Valores_especificados,A43+1,\"\")))","v":""},"2025-06-13","2025-06-13T10:00:00",null,"","","","","","","",""]
[{"$f":"IF(K44=0,\"\",IF(K44=\"\",\"\",IF(Valores_especificados,A44+1,\"\")))","v":""},"2025-07-13","2025-07-13T10:00:00",null,"","","","","","","",""]
[{"$f":"IF(K45=0,\"\",IF(K45=\"\",\"\",IF(Valores_especificados,A45+1,\"\")))","v":""},"2025-08-12","2025-08-12T10:00:00",null,"","","","","","","",""]
[{"$f":"IF(K46=0,\"\",IF(K46=\"\",\"\",IF(Valores_especificados,A46+1,\"\")))","v":""},"2025-09-11","2025-09-11T10:00:00",null,"","","","","","","",""]
[{"$f":"IF(K47=0,\"\",IF(K47=\"\",\"\",IF(Valores_especificados,A47+1,\"\")))","v":""},"2025-10-11","2025-10-11T10:00:00",null,"","","","","","","",""]
[{"$f":"IF(K48=0,\"\",IF(K48=\"\",\"\",IF(Valores_especificados,A48+1,\"\")))","v":""},"2025-11-10","2025-11-10T10:00:00",null,"","","","","","","",""]
[{"$f":"IF(K49=0,\"\",IF(K49=\"\",\"\",IF(Valores_especificados,A49+1,\"\")))","v":""},"2025-12-10","2025-12-10T10:00:00",null,"","","","","","","",""]
[{"$f":"IF(K50=0,\"\",IF(K50=\"\",\"\",IF(Valores_especificados,A50+1,\"\")))","v":""},"2026-01-09","2026-01-09T10:00:00",null,"","","","","","","",""]
[{"$f":"IF(K51=0,\"\",IF(K51=\"\",\"\",IF(Valores_especificados,A51+1,\"\")))","v":""},"2026-02-08","2026-02-08T10:00:00",null,"","","","","","","",""]
[{"$f":"IF(K52=0,\"\",IF(K52=\"\",\"\",IF(Valores_especificados,A52+1,\"\")))","v":""},"2026-03-10","2026-03-10T10:00:00",null,"","","","","","","",""]
[{"$f":"IF(K53=0,\"\",IF(K53=\"\",\"\",IF(Valores_especificados,A53+1,\"\")))","v":""},"2026-04-09","2026-04-09T10:00:00",null,"","","","","","","",""]
[{"$f":"IF(K54=0,\"\",IF(K54=\"\",\"\",IF(Valores_especificados,A54+1,\"\")))","v":""},"2026-05-09","2026-05-09T10:00:00",null,"","","","","","","",""]
[{"$f":"IF(K55=0,\"\",IF(K55=\"\",\"\",IF(Valores_especificados,A55+1,\"\")))","v":""},"2026-06-08","2026-06-08T10:00:00",null,"","","","","","","",""]
[{"$f":"IF(K56=0,\"\",IF(K56=\"\",\"\",IF(Valores_especificados,A56+1,\"\")))","v":""},"2026-07-08","2026-07-08T10:00:00",null,"","","","","","","",""]
[{"$f":"IF(K57=0,\"\",IF(K57=\"\",\"\",IF(Valores_especificados,A57+1,\"\")))","v":""},"2026-08-07","2026-08-07T10:00:00",null,"","","","","","","",""]
[{"$f":"IF(K58=0,\"\",IF(K58=\"\",\"\",IF(Valores_especificados,A58+1,\"\")))","v":""},"2026-09-06","2026-09-06T10:00:00",null,"","","","","","","",""]
[{"$f":"IF(K59=0,\"\",IF(K59=\"\",\"\",IF(Valores_especificados,A59+1,\"\")))","v":""},"2026-10-06","2026-10-06T10:00:00",null,"","","","","","","",""]
[{"$f":"IF(K60=0,\"\",IF(K60=\"\",\"\",IF(Valores_especificados,A60+1,\"\")))","v":""},"2026-11-05","2026-11-05T10:00:00",null,"","","","","","","",""]
[{"$f":"IF(K61=0,\"\",IF(K61=\"\",\"\",IF(Valores_especificados,A61+1,\"\")))","v":""},"2026-12-05","2026-12-05T10:00:00",null,"","","","","","","",""]
[{"$f":"IF(K62=0,\"\",IF(K62=\"\",\"\",IF(Valores_especificados,A62+1,\"\")))","v":""},"2027-01-04","2027-01-04T10:00:00",null,"","","","","","","",""]
[{"$f":"IF(K63=0,\"\",IF(K63=\"\",\"\",IF(Valores_especificados,A63+1,\"\")))","v":""},"2027-02-03","2027-02-03T10:00:00",null,"","","","","","","",""]
[{"$f":"IF(K64=0,\"\",IF(K64=\"\",\"\",IF(Valores_especificados,A64+1,\"\")))","v":""},"2027-03-05","2027-03-05T10:00:00",null,"","","","","","","",""]
[{"$f":"IF(K65=0,\"\",IF(K65=\"\",\"\",IF(Valores_especificados,A65+1,\"\")))","v":""},"2027-04-04","2027-04-04T10:00:00",null,"","","","","","","",""]
[{"$f":"IF(K66=0,\"\",IF(K66=\"\",\"\",IF(Valores_especificados,A66+1,\"\")))","v":""},"2027-05-04","2027-05-04T10:00:00",null,"","","","","","","",""]
[{"$f":"IF(K67=0,\"\",IF(K67=\"\",\"\",IF(Valores_especificados,A67+1,\"\")))","v":""},"2027-06-03","2027-06-03T10:00:00",null,"","","","","","","",""]
[{"$f":"IF(K68=0,\"\",IF(K68=\"\",\"\",IF(Valores_especificados,A68+1,\"\")))","v":""},"2027-07-03","2027-07-03T10:00:00",null,"","","","","","","",""]
[{"$f":"IF(K69=0,\"\",IF(K69=\"\",\"\",IF(Valores_especificados,A69+1,\"\")))","v":""},"2027-08-02","2027-08-02T10:00:00",null,"","","","","","","",""]
[{"$f":"IF(K70=0,\"\",IF(K70=\"\",\"\",IF(Valores_especificados,A70+1,\"\")))","v":""},"2027-09-01","2027-09-01T10:00:00",null,"","","","","","","",""]
[{"$f":"IF(K71=0,\"\",IF(K71=\"\",\"\",IF(Valores_especificados,A71+1,\"\")))","v":""},"2027-10-01","2027-10-01T10:00:00",null,"","","","","","","",""]
[{"$f":"IF(K72=0,\"\",IF(K72=\"\",\"\",IF(Valores_especificados,A72+1,\"\")))","v":""},"2027-10-31","2027-10-31T10:00:00",null,"","","","","","","",""]
[{"$f":"IF(K73=0,\"\",IF(K73=\"\",\"\",IF(Valores_especificados,A73+1,\"\")))","v":""},"2027-11-30","2027-11-30T10:00:00",null,"","","","","","","",""]
[{"$f":"IF(K74=0,\"\",IF(K74=\"\",\"\",IF(Valores_especificados,A74+1,\"\")))","v":""},"2027-12-30","2027-12-30T10:00:00",null,"","","","","","","",""]
[{"$f":"IF(K75=0,\"\",IF(K75=\"\",\"\",IF(Valores_especificados,A75+1,\"\")))","v":""},"2028-01-29","2028-01-29T10:00:00",null,"","","","","","","",""]
[{"$f":"IF(K76=0,\"\",IF(K76=\"\",\"\",IF(Valores_especificados,A76+1,\"\")))","v":""},"2028-02-28","2028-02-28T10:00:00",null,"","","","","","","",""]
[{"$f":"IF(K77=0,\"\",IF(K77=\"\",\"\",IF(Valores_especificados,A77+1,\"\")))","v":""},"2028-03-29","2028-03-29T10:00:00",null,"","","","","","","",""]
[{"$f":"IF(K78=0,\"\",IF(K78=\"\",\"\",IF(Valores_especificados,A78+1,\"\")))","v":""},"2028-04-28","2028-04-28T10:00:00",null,"","","","","","","",""]
[{"$f":"IF(K79=0,\"\",IF(K79=\"\",\"\",IF(Valores_especificados,A79+1,\"\")))","v":""},"2028-05-28","2028-05-28T10:00:00",null,"","","","","","","",""]
[{"$f":"IF(K80=0,\"\",IF(K80=\"\",\"\",IF(Valores_especificados,A80+1,\"\")))","v":""},"2028-06-27","2028-06-27T10:00:00",null,"","","","","","","",""]
[{"$f":"IF(K81=0,\"\",IF(K81=\"\",\"\",IF(Valores_especificados,A81+1,\"\")))","v":""},"2028-07-27","2028-07-27T10:00:00",null,"","","","","","","",""]
[{"$f":"IF(K82=0,\"\",IF(K82=\"\",\"\",IF(Valores_especificados,A82+1,\"\")))","v":""},"2028-08-26","2028-08-26T10:00:00",null,"","","","","","","",""]
[{"$f":"IF(K83=0,\"\",IF(K83=\"\",\"\",IF(Valores_especificados,A83+1,\"\")))","v":""},"2028-09-25","2028-09-25T10:00:00",null,"","","","","","",{"$f":"IF(Núm_de_pago<>\"\",Saldo_inicial-Capital,IF(Núm_de_pago<>\"\",0,\"\"))","v":""},""]
[{"$f":"IF(K84=0,\"\",IF(K84=\"\",\"\",IF(Valores_especificados,A84+1,\"\")))","v":""},"2028-10-25","2028-10-25T10:00:00",null,{"$f":"IF(Núm_de_pago<>\"\",IF(WEEKDAY(C85)=1,1,\"\"),\"\")","v":""},{"$f":"IF(K84=0,\"\",IF(K84=\"\",\"\",IF($O$5=$M$14,DAYS360(B84,B85,TRUE),_xlfn.DAYS(B85,B84))))","v":""},{"$f":"IF(Núm_de_pago<>\"\",K84,\"\")","v":""},{"$f":"IF(Núm_de_pago<>\"\",IF(K84<Pago_mensual_programado,I85+J85,Pago_mensual_programado),\"\")","v":""},{"$f":"IF(K84<Pago_mensual_programado,K84,IF(Núm_de_pago<>\"\",Pago_progr-Int,\"\"))","v":""},"","",{"$f":"IF(A85=\"\",\"\",SUM(OFFSET($I$20,,1,1+A84)))","v":""}]
[{"$f":"IF(K85=0,\"\",IF(K85=\"\",\"\",IF(Valores_especificados,A85+1,\"\")))","v":""},{"$f":"B85+$M$9","v":"2028-11-24"},{"$f":"B85+(365/M$10)","v":"2028-11-24T10:00:00"},null,"","","","","",{"$f":"IF(Núm_de_pago<>\"\",Saldo_inicial*(Tasa_de_interés/IF($O$5=\"Dias 360\",360,365))*Dias_,\"\")","v":""},"",""]
[{"$f":"IF(K86=0,\"\",IF(K86=\"\",\"\",IF(Valores_especificados,A86+1,\"\")))","v":""},"2028-12-24","2028-12-24T10:00:00",null,"","","","","","","",""]
[{"$f":"IF(K87=0,\"\",IF(K87=\"\",\"\",IF(Valores_especificados,A87+1,\"\")))","v":""},"2029-01-23","2029-01-23T10:00:00",null,"","","","","","","",""]
[{"$f":"IF(K88=0,\"\",IF(K88=\"\",\"\",IF(Valores_especificados,A88+1,\"\")))","v":""},"2029-02-22","2029-02-22T10:00:00",null,"","","","","","","",""]
[{"$f":"IF(K89=0,\"\",IF(K89=\"\",\"\",IF(Valores_especificados,A89+1,\"\")))","v":""},"2029-03-24","2029-03-24T10:00:00",null,"","","","","","","",""]
[{"$f":"IF(K90=0,\"\",IF(K90=\"\",\"\",IF(Valores_especificados,A90+1,\"\")))","v":""},"2029-04-23","2029-04-23T10:00:00",null,"","","","","","","",""]
[{"$f":"IF(K91=0,\"\",IF(K91=\"\",\"\",IF(Valores_especificados,A91+1,\"\")))","v":""},"2029-05-23","2029-05-23T10:00:00",null,"","","","","","","",""]
[{"$f":"IF(K92=0,\"\",IF(K92=\"\",\"\",IF(Valores_especificados,A92+1,\"\")))","v":""},"2029-06-22","2029-06-22T10:00:00",null,"","","","","","","",""]
[{"$f":"IF(K93=0,\"\",IF(K93=\"\",\"\",IF(Valores_especificados,A93+1,\"\")))","v":""},"2029-07-22","2029-07-22T10:00:00",null,"","","","","","","",""]
[{"$f":"IF(K94=0,\"\",IF(K94=\"\",\"\",IF(Valores_especificados,A94+1,\"\")))","v":""},"2029-08-21","2029-08-21T10:00:00",null,"","","","","","","",""]
[{"$f":"IF(K95=0,\"\",IF(K95=\"\",\"\",IF(Valores_especificados,A95+1,\"\")))","v":""},"2029-09-20","2029-09-20T10:00:00",null,"","","","","","","",""]
[{"$f":"IF(K96=0,\"\",IF(K96=\"\",\"\",IF(Valores_especificados,A96+1,\"\")))","v":""},"2029-10-20","2029-10-20T10:00:00",null,"","","","","","","",""]
[{"$f":"IF(K97=0,\"\",IF(K97=\"\",\"\",IF(Valores_especificados,A97+1,\"\")))","v":""},"2029-11-19","2029-11-19T10:00:00",null,"","","","","","","",""]
[{"$f":"IF(K98=0,\"\",IF(K98=\"\",\"\",IF(Valores_especificados,A98+1,\"\")))","v":""},"2029-12-19","2029-12-19T10:00:00",null,"","","","","","","",""]
[{"$f":"IF(K99=0,\"\",IF(K99=\"\",\"\",IF(Valores_especificados,A99+1,\"\")))","v":""},"2030-01-18","2030-01-18T10:00:00",null,"","","","","","","",""]
[{"$f":"IF(K100=0,\"\",IF(K100=\"\",\"\",IF(Valores_especificados,A100+1,\"\")))","v":""},"2030-02-17","2030-02-17T10:00:00",null,"","","","","","","",""]
[{"$f":"IF(K101=0,\"\",IF(K101=\"\",\"\",IF(Valores_especificados,A101+1,\"\")))","v":""},"2030-03-19","2030-03-19T10:00:00",null,"","","","","","","",""]
[{"$f":"IF(K102=0,\"\",IF(K102=\"\",\"\",IF(Valores_especificados,A102+1,\"\")))","v":""},"2030-04-18","2030-04-18T10:00:00",null,"","","","","","","",""]
[{"$f":"IF(K103=0,\"\",IF(K103=\"\",\"\",IF(Valores_especificados,A103+1,\"\")))","v":""},"2030-05-18","2030-05-18T10:00:00",null,"","","","","","","",""]
[{"$f":"IF(K104=0,\"\",IF(K104=\"\",\"\",IF(Valores_especificados,A104+1,\"\")))","v":""},"2030-06-17","2030-06-17T10:00:00",null,"","","","","","","",""]
[{"$f":"IF(K105=0,\"\",IF(K105=\"\",\"\",IF(Valores_especificados,A105+1,\"\")))","v":""},"2030-07-17","2030-07-17T10:00:00",null,"","","","","","","",""]
[{"$f":"IF(K106=0,\"\",IF(K106=\"\",\"\",IF(Valores_especificados,A106+1,\"\")))","v":""},"2030-08-16","2030-08-16T10:00:00",null,"","","","","","","",""]
[{"$f":"IF(K107=0,\"\",IF(K107=\"\",\"\",IF(Valores_especificados,A107+1,\"\")))","v":""},"2030-09-15","2030-09-15T10:00:00",null,"","","","","","","",""]
[{"$f":"IF(K108=0,\"\",IF(K108=\"\",\"\",IF(Valores_especificados,A108+1,\"\")))","v":""},"2030-10-15","2030-10-15T10:00:00",null,"","","","","","","",""]
[{"$f":"IF(K109=0,\"\",IF(K109=\"\",\"\",IF(Valores_especificados,A109+1,\"\")))","v":""},"2030-11-14","2030-11-14T10:00:00",null,"","","","","","","",""]
[{"$f":"IF(K110=0,\"\",IF(K110=\"\",\"\",IF(Valores_especificados,A110+1,\"\")))","v":""},"2030-12-14","2030-12-14T10:00:00",null,"","","","","","","",""]
[{"$f":"IF(K111=0,\"\",IF(K111=\"\",\"\",IF(Valores_especificados,A111+1,\"\")))","v":""},"2031-01-13","2031-01-13T10:00:00",null,"","","","","","","",""]
[{"$f":"IF(K112=0,\"\",IF(K112=\"\",\"\",IF(Valores_especificados,A112+1,\"\")))","v":""},"2031-02-12","2031-02-12T10:00:00",null,"","","","","","","",""]
[{"$f":"IF(K113=0,\"\",IF(K113=\"\",\"\",IF(Valores_especificados,A113+1,\"\")))","v":""},"2031-03-14","2031-03-14T10:00:00",null,"","","","","","","",""]
[{"$f":"IF(K114=0,\"\",IF(K114=\"\",\"\",IF(Valores_especificados,A114+1,\"\")))","v":""},"2031-04-13","2031-04-13T10:00:00",null,"","","","","","","",""]
[{"$f":"IF(K115=0,\"\",IF(K115=\"\",\"\",IF(Valores_especificados,A115+1,\"\")))","v":""},"2031-05-13","2031-05-13T10:00:00",null,"","","","","","","",""]
[{"$f":"IF(K116=0,\"\",IF(K116=\"\",\"\",IF(Valores_especificados,A116+1,\"\")))","v":""},"2031-06-12","2031-06-12T10:00:00",null,"","","","","","","",""]
[{"$f":"IF(K117=0,\"\",IF(K117=\"\",\"\",IF(Valores_especificados,A117+1,\"\")))","v":""},"2031-07-12","2031-07-12T10:00:00",null,"","","","","","","",""]
[{"$f":"IF(K118=0,\"\",IF(K118=\"\",\"\",IF(Valores_especificados,A118+1,\"\")))","v":""},"2031-08-11","2031-08-11T10:00:00",null,"","","","","","","",""]
[{"$f":"IF(K119=0,\"\",IF(K119=\"\",\"\",IF(Valores_especificados,A119+1,\"\")))","v":""},"2031-09-10","2031-09-10T10:00:00",null,"","","","","","","",""]
{"$rows_left_out":380}
{"sheet":"Hoja1","index":1,"n_rows":9,"n_cols":3,"rows_kept":9,"cut":false,"hidden":true,"merged":[]}
["Periodicidad","No","Dias"]
["En Años",1,365]
["Al Vencimiento",1,365]
["En Semestres",2,180]
["En Trimestres",4,90]
["En Bimestres",6,60]
["En Meses",12,30]
["En Quincenas",24,15]
["En Semanas",47,7]